{"text_format":"1","workbook":"xlsx","n_sheets":10,"sheets":["Veiledning","Prosjektbeskrivelse","Skisseprosjekt","Referansebygg","Forprosjekt","Detaljprosjekt","Som bygget","Resultater","Utslippsfaktorer","Input_rullegardin"],"not_rendered":{"charts":3,"images":1,"macros":1,"external_links":0,"defined_names":17,"comments":9,"pivot_tables":0},"unopened":[],"bounds":{"document_bytes":16777216,"sheet_cells":100000,"rows_first":2000,"rows_last":500,"rows_between":2000,"halvings":0,"cell_chars":16384,"cell_head_chars":4096},"cells_cut":0,"cells_raw":0,"read":"whole","date_system":"1900"}

{"sheet":"Veiledning","index":0,"n_rows":18,"n_cols":2,"rows_kept":18,"cut":false,"hidden":false,"merged":[]}
[null,"Trondheim kommunes mal for klimagassregnskap i byggeprosjekter"]
[null,"Versjon 2023-04-13. Utviklet av SINTEF AS."]
[null,"Dette dokumentet er ment for å estimere og dokumentere klimagassutslipp (greenhouse gases, GHG) i byggeprosjekter. Beregningene er basert på NS 3720, NS 3451, og TEK veileder for GHG regnskap (fortsatt under utarbeidelse av DiBK). Den inkluderer data fra EPD-Norge og PROfet (estimat av energibehov utviklet av SINTEF)."]
[]
[null,"Hvordan skal denne malen brukes?"]
[]
[null,"Prosedyre - trinn for trinn:"]
[null,"1. Fyll ut prosjektbeskrivelsen og velg opsjoner for klimagassberegning i \"Projektbeskrivelse\"-fanen. Velg hvilken fase som skal rapporteres."]
[]
[null,"2. Fyll inn malene for valgt prosjektfase. Velg produkter og prosesser fra rullegardinmenyen, eller skriv inn egne data. Skriv inn produktmengder."]
{"$rows_left_out":9}
{"sheet":"Prosjektbeskrivelse","index":1,"n_rows":30,"n_cols":5,"rows_kept":30,"cut":false,"hidden":false,"merged":[]}
[]
[null,"Beskrivelse av prosjekt og klimagassberegning"]
[]
[null,"Prosjektbeskrivelse",null,null,"Kommentar"]
[null,"Prosjektnavn","Fjell barnehage"]
[null,"Prosjektadresse"]
[null,"Prosjektnummer"]
[null,"Dato (når malen er fylt ut)","2023-01-10"]
[null,"Utført av (navn, etternavn)","Kristin Navn"]
[null,"Virksomhet","Grønnbygg AS"]
{"$rows_left_out":21}
{"sheet":"Skisseprosjekt","index":2,"n_rows":55,"n_cols":14,"rows_kept":55,"cut":false,"hidden":false,"merged":[[1,8,1,11],[2,1,2,6]]}
[]
[null,"Skisseprosjekt",null,null,null,null,null,null,"Utslipp A1-A3 + A4 + A5 + B4 + B6 + B8",null,null,null,{"$f":"IF(F8=\"NA\",\"Ikke spesifiert\",SUM(F11:K11))","v":59754.088799999998},"kgCO2e"]
[null,"Denne regneark viser estimert klimagassutslipper fra A1-A3, A4, B4, B6 og B8 moduler, basert på bygningstype (hovedfunksjon) og BTA areal som definert i \"Prosjektbeskrivekse\", og miljømåltype og energieffektivitetnivå, som må velges her i rader 15 og 19. Valgfritt: For bygningens energibruk, verdioverstyring kan skrives i kolon G i sted av nøkkelverdi fra PROfet/TEK17."]
[]
[]
[null,null,null,null,null,"Produktstadiet","Transport","Bygge- og monteringsarbeid","Utskiftning","Energibruk i drift","Transport i drift"]
[null,null,null,null,null,"A1-A3","A4","A5","B4","B6","B8"]
[null,null,null,null,"Utslippsintensitet (kg CO2e/m2BTA/år)",{"$f":"VLOOKUP(_xlfn.CONCAT($D$17,\" \",Prosjektbeskrivelse!$C$16),Input_rullegardin!$S$4:$V$51,2,FALSE)","v":3.87},{"$f":"VLOOKUP(_xlfn.CONCAT($D$17,\" \",Prosjektbeskrivelse!$C$16),Input_rullegardin!$S$4:$V$51,3,FALSE)","v":0.09},null,{"$f":"VLOOKUP(_xlfn.CONCAT($D$17,\" \",Prosjektbeskrivelse!$C$16),Input_rullegardin!$S$4:$V$51,4,FALSE)","v":0.09}]
[null,null,null,null,"Utslippsintensitet - verdier fra egen beregning (kg CO2e/m2BTA/år)"]
[]
{"$rows_left_out":46}
{"sheet":"Referansebygg","index":3,"n_rows":70,"n_cols":16,"rows_kept":70,"cut":false,"hidden":false,"merged":[[66,5,66,6],[67,5,67,6],[12,3,12,4],[4,1,4,3],[1,9,1,11],[60,5,60,6],[61,5,61,6],[62,5,62,6],[65,5,65,6]]}
[]
[null,"Referansebygg",null,null,null,null,null,null,null,"Utslipp A1-A3 + A4 + A5 + B3 + B4 + B6 + C1-4",null,null,{"$f":"SUM(M5,M60,M65)","v":3189633.9408126804},"kgCO2e"]
[]
[]
[null,"Materialer (A1-A3; A4; A5.1;B4,C1-4)",null,null,null,null,null,null,null,null,null,null,{"$f":"SUM(M8,M13,M19,M26,M33,M41)","v":3133419.9408126804},null,null,{"$f":"M5/$M$2","v":0.98237603403929252}]
[null,null,null,null,"Kategori","A1-A3 Produktstadiet","A4 Transport","A5 Materialsvinn","B3 Reparasjon","B4 Utskiftning","B6 Energibruk i drift","C1-C4 Livsløpets sluttstadiet","Klimagassutslipp","Andel %"]
[null,null,null,null,"-","kgCO2e","kgCO2e","kgCO2e","kgCO2e","kgCO2e","kgCO2e","kgCO2e","kgCO2e","-"]
[null,null,21,"Fundamentering",null,{"$f":"IFERROR((SUM(F9:F12)),\"Not assessed\")","v":301122},{"$f":"IFERROR((SUM(G9:G12)),\"Not assessed\")","v":38592.743527839099},{"$f":"IFERROR((SUM(H9:H12)),\"Not assessed\")","v":26892.649939452702},null,{"$f":"IFERROR((SUM(J9:J12)),\"Not assessed\")","v":0},null,{"$f":"IFERROR((SUM(L9:L12)),\"Not assessed\")","v":109371.23257390995},{"$f":"IFERROR((SUM(M9:M12)),\"Not assessed\")","v":475978.62604120176},null,{"$f":"M8/$M$2","v":0.14922672471936643}]
[null,null,null,null,"216 - Direkte fundamentering",301122,38592.743527839099,26892.649939452702,0,0,0,109371.23257390995,{"$f":"SUM(F9:L9)","v":475978.62604120176},{"$f":"IFERROR(M9/$M$8,0)","v":1}]
[null,null,null,null,null,null,null,null,null,null,null,null,{"$f":"SUM(F10:L10)","v":0},{"$f":"IFERROR(M10/$M$8,0)","v":0}]
{"$rows_left_out":61}
{"sheet":"Forprosjekt","index":4,"n_rows":66,"n_cols":17,"rows_kept":66,"cut":false,"hidden":false,"merged":[[12,3,12,5],[2,1,2,8],[1,11,1,12]]}
[]
[null,"Forprosjekt ",null,null,null,null,null,null,null,null,null,"Utslipp A1-A3 + A4 + A5 + B4 + B6",null,{"$f":"SUM(N4,N49,N54)","v":142610.58425809091},"kgCO2e"]
[null,"Velg først Kategori og velg så Materialer fra rullegardinmenyen. Legg inn Mengde eller skriv inn verdiene manuelt. Alternativt kan nøkkelverdier (gjennomsnittsverdier fra ZEN-rapport 24) brukes."]
["Seksjon1","Bygningselementer",null,null,null,null,null,null,null,null,null,0.05,null,{"$f":"SUM(N7,N13,N18,N23,N28,N33,N38,N43)","v":92096.584258090908},null,null,{"$f":"N4/$N$2","v":0.64579066650072903}]
[null,null,null,null,"Kategori","Materiale eller prosess","Mengde","Enhet","Levetid","A1-A3 Produktstadiet","A4 Transport","A5 Materialsvinn","B4 Utskiftning","Klimagassutslipp","Andel %"]
[null,null,null,null,"-","-","-","-","år","kgCO2e","kgCO2e","kgCO2e","kgCO2e","kgCO2e","-"]
[null,null,21,"Fundamentering",null,null,null,null,null,{"$f":"IF($E$8,J8,SUMIF($D$9:$D$11,$C$7,J$9:J$11))","v":34354.131818181821},{"$f":"IF($E$8,K8,SUMIF($D$9:$D$11,$C$7,K$9:K$11))","v":38.32938},{"$f":"IF($E$8,L8,SUMIF($D$9:$D$11,$C$7,L$9:L$11))","v":1719.6230599090909},{"$f":"IF($E$8,M8,SUMIF($D$9:$D$11,$C$7,M$9:M$11))","v":0},{"$f":"IF($E$8,N8,SUMIF($D$9:$D$11,$C$7,N$9:N$11))","v":36112.084258090908},null,{"$f":"IFERROR(N7/$N$4,0)","v":0.39211100551667172}]
[null,null,null,null,false,"Bygningsdel 21, gjennomsnitt, per m2 bygg",{"$f":"Prosjektbeskrivelse!$C$19*60","v":8700},{"$f":"VLOOKUP($F8,Utslippsfaktorer!$B$6:$U$332,5,FALSE)","v":"m2BTAår"},null,{"$f":"IFERROR(VLOOKUP($F8,Utslippsfaktorer!$B$6:$U$332,7,FALSE)*G8,0)","v":7829.9999999999991},{"$f":"VLOOKUP($F8,Utslippsfaktorer!$B$6:$U$332,8,FALSE)*$G8","v":0},{"$f":"(J8+K8)*$L$4","v":391.5},{"$f":"VLOOKUP($F8,Utslippsfaktorer!$B$6:$U$332,13,FALSE)*$G8","v":1957.4999999999998},{"$f":"SUM(J8:M8)","v":10179},"-"]
[null,null,null,21,"(egen data)",null,null,null,null,null,null,{"$f":"(J9+K9)*$L$4","v":0},null,{"$f":"SUM(J9:M9)","v":0},{"$f":"IFERROR(N9/$N$7,0)","v":0}]
[null,null,null,21,"Betong","Betong B30, bransjereferanse",120,{"$f":"VLOOKUP($F10,Utslippsfaktorer!$B$6:$U$332,5,FALSE)","v":"m3"},{"$f":"VLOOKUP($F10,Utslippsfaktorer!$B$6:$U$332,6,FALSE)","v":60},{"$f":"IFERROR(VLOOKUP($F10,Utslippsfaktorer!$B$6:$U$332,7,FALSE)*$G10,0)","v":33600},{"$f":"VLOOKUP($F10,Utslippsfaktorer!$B$6:$U$332,8,FALSE)*$G10","v":38.304000000000002},1681.9151999999999,{"$f":"VLOOKUP($F10,Utslippsfaktorer!$B$6:$U$332,13,FALSE)*$G10","v":0},35320.2192,{"$f":"IFERROR(N10/$N$7,0)","v":0.97807202009079575}]
{"$rows_left_out":57}
{"sheet":"Detaljprosjekt","index":5,"n_rows":166,"n_cols":25,"rows_kept":166,"cut":false,"hidden":false,"merged":[[1,1,1,3],[5,2,5,3],[1,20,1,21],[1,16,1,19],[155,6,155,8],[155,9,155,10],[155,12,155,13],[155,15,155,16]]}
[]
[null,"Detaljprosjekt",null,null,null,null,null,null,null,null,null,null,null,null,null,null,"Utslipp A1-C4",null,null,null,{"$f":"SUM(V4,V150,V155)","v":107710.54157499367},null,"kgCO2e"]
[]
[null,"Bygningselementer",null,null,null,null,null,null,null,null,null,null,null,null,null,null,null,null,null,null,null,{"$f":"SUM(V8,V18,V37,V61,V82,V103)","v":60502.69157499366},null,null,{"$f":"IFERROR(V4/$U$2,0)","v":0.56171560081580829}]
[null,null,null,null,null,null,null,null,null,"Produktstadiet","Transport","Monterings-arbeid","Bruk","Vedlikehold","Reparasjon","Utskiftning","Ombygging","Riving","Transport","Avfalls-behandling","Avhending"]
[null,null,"Bygningselement",null,"Kategori","Materialer eller prosesser","Mengde","Enhet","Levetid","A1-A3","A4","A5-svinn","B1","B2","B3","B4","B5","C1","C2","C3","C4","Klimagassutslipp","Andel % per bygningselement","Kilde"]
[null,null,null,null,null,null,null,null,"år","kgCO2e","kgCO2e","kgCO2e","kgCO2e","kgCO2e","kgCO2e","kgCO2e","kgCO2e","kgCO2e","kgCO2e","kgCO2e","kgCO2e","kgCO2e","-"]
["seksjon1",null,21,"Fundamentering",null,null,null,null,null,{"$f":"IFERROR(SUM(J9:J17),\"Not assessed\")","v":10375.099014993661},3.5388599999999997,152.59999999999997,0,0,0,0,0,0,0,0,0,10531.237874993662,null,{"$f":"IFERROR(V8/$U$2,0)","v":9.7773511496655766E-2}]
[null,null,21,21,"(egen data)",null,0,null,null,null,null,null,null,null,null,null,null,null,null,null,null,{"$f":"SUM(J9:U9)","v":0},{"$f":"IFERROR(V9/$V$8,0)","v":0}]
[null,null,21,"215 Pelefundamentering ","Betong","Betong B45, bransjereferanse",10,{"$f":"VLOOKUP($F10,Utslippsfaktorer!$B$6:$U$332,5,FALSE)","v":"m3"},{"$f":"VLOOKUP($F10,Utslippsfaktorer!$B$6:$U$332,6,FALSE)","v":60},{"$f":"IFERROR(VLOOKUP($F10,Utslippsfaktorer!$B$6:$U$332,7,FALSE)*$G10,0)","v":3600},{"$f":"VLOOKUP($F10,Utslippsfaktorer!$B$6:$U$332,8,FALSE)*$G10","v":3.1920000000000002},{"$f":"VLOOKUP($F10,Utslippsfaktorer!$B$6:$U$332,9,FALSE)*$G10","v":0},{"$f":"VLOOKUP($F10,Utslippsfaktorer!$B$6:$U$332,10,FALSE)*$G10","v":0},{"$f":"VLOOKUP($F10,Utslippsfaktorer!$B$6:$U$332,11,FALSE)*$G10","v":0},{"$f":"VLOOKUP($F10,Utslippsfaktorer!$B$6:$U$332,12,FALSE)*$G10","v":0},{"$f":"VLOOKUP($F10,Utslippsfaktorer!$B$6:$U$332,13,FALSE)*$G10","v":0},{"$f":"VLOOKUP($F10,Utslippsfaktorer!$B$6:$U$332,14,FALSE)*$G10","v":0},{"$f":"VLOOKUP($F10,Utslippsfaktorer!$B$6:$U$332,16,FALSE)*$G10","v":0},{"$f":"VLOOKUP($F10,Utslippsfaktorer!$B$6:$U$332,17,FALSE)*$G10","v":0},{"$f":"VLOOKUP($F10,Utslippsfaktorer!$B$6:$U$332,18,FALSE)*$G10","v":0},{"$f":"VLOOKUP($F10,Utslippsfaktorer!$B$6:$U$332,19,FALSE)*$G10","v":0},{"$f":"SUM(J10:U10)","v":3603.192},{"$f":"IFERROR(V10/$V$8,0)","v":0.34214325445594101},{"$f":"VLOOKUP($F10,Utslippsfaktorer!$B$6:$U$332,3,FALSE)","v":0}]
{"$rows_left_out":157}
{"sheet":"Som bygget","index":6,"n_rows":167,"n_cols":25,"rows_kept":167,"cut":false,"hidden":false,"merged":[[1,20,1,21],[1,1,1,3],[1,16,1,19],[156,6,156,8],[156,9,156,10],[156,12,156,13],[156,15,156,16],[5,2,5,3]]}
[]
[null,"Som bygget",null,null,null,null,null,null,null,null,null,null,null,null,null,null,"Utslipp A1-C4",null,null,null,{"$f":"SUM(V4,V151,V156)","v":98766.143974993669},null,"kgCO2e"]
[]
[null,"Bygningselementer",null,null,null,null,null,null,null,null,null,null,null,null,null,null,null,null,null,null,null,{"$f":"SUM(V8,V18,V37,V62,V83,V104)","v":72282.143974993669},null,null,{"$f":"IFERROR(V4/$U$2,0)","v":0.7318514327469805}]
[null,null,null,null,null,null,null,null,null,"Produktstadiet","Transport","Monterings-arbeid","Bruk","Vedlikehold","Reparasjon","Utskiftning","Ombygging","Riving","Transport","Avfalls-behandling","Avhending"]
[null,null,"Bygningselement",null,"Kategori","Materialer eller prosesser","Mengde","Enhet","Levetid","A1-A3","A4","A5-svinn","B1","B2","B3","B4","B5","C1","C2","C3","C4","Klimagassutslipp","Andel % per bygningselement","Kilde"]
[null,null,null,null,null,null,null,null,"år","kgCO2e","kgCO2e","kgCO2e","kgCO2e","kgCO2e","kgCO2e","kgCO2e","kgCO2e","kgCO2e","kgCO2e","kgCO2e","kgCO2e","kgCO2e","-"]
["seksjon1",null,21,"Fundamentering",null,null,null,null,null,{"$f":"IFERROR(SUM(J9:J17),\"Not assessed\")","v":8775.0990149936606},3.5388599999999997,152.59999999999997,0,0,0,0,0,0,0,0,0,8931.2378749936615,null,{"$f":"IFERROR(V8/$U$2,0)","v":9.0428131701232942E-2}]
[null,null,21,21,"(egen data)",null,0,null,null,null,null,null,null,null,null,null,null,null,null,null,null,{"$f":"SUM(J9:U9)","v":0},{"$f":"IFERROR(V9/$V$8,0)","v":0}]
[null,null,21,"215 Pelefundamentering ","Betong","Betong B30, lavkarbon A",10,{"$f":"VLOOKUP($F10,Utslippsfaktorer!$B$6:$U$332,5,FALSE)","v":"m3"},{"$f":"VLOOKUP($F10,Utslippsfaktorer!$B$6:$U$332,6,FALSE)","v":60},{"$f":"IFERROR(VLOOKUP($F10,Utslippsfaktorer!$B$6:$U$332,7,FALSE)*$G10,0)","v":2000},{"$f":"VLOOKUP($F10,Utslippsfaktorer!$B$6:$U$332,8,FALSE)*$G10","v":3.1920000000000002},{"$f":"VLOOKUP($F10,Utslippsfaktorer!$B$6:$U$332,9,FALSE)*$G10","v":0},{"$f":"VLOOKUP($F10,Utslippsfaktorer!$B$6:$U$332,10,FALSE)*$G10","v":0},{"$f":"VLOOKUP($F10,Utslippsfaktorer!$B$6:$U$332,11,FALSE)*$G10","v":0},{"$f":"VLOOKUP($F10,Utslippsfaktorer!$B$6:$U$332,12,FALSE)*$G10","v":0},{"$f":"VLOOKUP($F10,Utslippsfaktorer!$B$6:$U$332,13,FALSE)*$G10","v":0},{"$f":"VLOOKUP($F10,Utslippsfaktorer!$B$6:$U$332,14,FALSE)*$G10","v":0},{"$f":"VLOOKUP($F10,Utslippsfaktorer!$B$6:$U$332,16,FALSE)*$G10","v":0},{"$f":"VLOOKUP($F10,Utslippsfaktorer!$B$6:$U$332,17,FALSE)*$G10","v":0},{"$f":"VLOOKUP($F10,Utslippsfaktorer!$B$6:$U$332,18,FALSE)*$G10","v":0},{"$f":"VLOOKUP($F10,Utslippsfaktorer!$B$6:$U$332,19,FALSE)*$G10","v":0},{"$f":"SUM(J10:U10)","v":2003.192},{"$f":"IFERROR(V10/$V$8,0)","v":0.22429052143025824},{"$f":"VLOOKUP($F10,Utslippsfaktorer!$B$6:$U$332,3,FALSE)","v":0}]
{"$rows_left_out":158}
{"sheet":"Resultater","index":7,"n_rows":162,"n_cols":21,"rows_kept":162,"cut":false,"hidden":false,"merged":[[60,17,60,18],[126,2,126,16],[60,15,60,16],[127,15,127,16],[92,2,92,16],[93,15,93,16],[59,2,59,16],[4,1,5,1],[3,19,3,20],[3,17,3,18],[3,15,3,16]]}
[]
[null,null,"Klimagassregnskap, resultater"]
[]
[null,null,null,null,"Produktstadiet","Transport","Bygge- og monterings-arbeid","Bygge- og monterings-arbeid","Vedlikehold","Reparasjon","Utskiftning","Energibruk i drift","Transport i drift","Sluttstadiet",null,"TEK17 krav ",null,"Trondheim kommunes krav",null,"Alle moduler"]
[null,"Prosjektspesifikke verdier?",null,null,"A1-A3","A4","A5-Svinn","A5-Arbeid","B2","B3","B4","B6","B8","C1-C4",null,"Totalt klimagassutslipp","Klimagassutslipp per år og per m2 BTA","Totalt","Klimagassutslipp per år og per m2 BTA","Totalt","Klimagassutslipp per år og per m2 BTA"]
[null,null,null,null,"kgCO2e","kgCO2e","kgCO2e","kgCO2e","kgCO2e","kgCO2e","kgCO2e","kgCO2e","kgCO2e","kgCO2e",null,"kgCO2e","kgCO2e/(m2BTA.år)","kgCO2e","kgCO2e/(m2BTA.år)","kgCO2e","kgCO2e/(m2BTA.år)"]
[]
[null,{"$f":"IF(COUNTA(Skisseprosjekt!F9:K9,Skisseprosjekt!G46:G52)=0,\"Nei\",\"Ja\")","v":"Nei"},"Skisseprosjekt/Reguleringsfase",null,{"$f":"Skisseprosjekt!F11","v":28057.5},{"$f":"Skisseprosjekt!G11","v":652.5},"-",{"$f":"Skisseprosjekt!H11","v":11194.588800000001},"-","-",{"$f":"Skisseprosjekt!I11","v":652.5},{"$f":"Skisseprosjekt!J11","v":19197},{"$f":"Skisseprosjekt!K11","v":0},"-",null,"-","-",{"$f":"SUM(E8:F8,H8,K8:M8)","v":59754.088799999998},{"$f":"IFERROR(R8/(Prosjektbeskrivelse!$C$19*Prosjektbeskrivelse!$C$18),0)","v":8.241943282758621},"-","-"]
[]
[]
{"$rows_left_out":153}
{"sheet":"Utslippsfaktorer","index":8,"n_rows":203,"n_cols":28,"rows_kept":203,"cut":false,"hidden":true,"merged":[[2,7,2,20],[3,8,3,9],[3,10,3,15],[3,16,3,19]]}
[null,"Utslippsfaktorer"]
[]
[null,null,null,null,null,null,null,"GWP per enhet [kgCO2e/enhet]"]
[null,"Kategoriene må listes i alfabetisk rekkefølge, og alle produkter må tilknyttes en kategori.",null,null,null,null,null,"Produkt-stadiet","Gjennomføringsstadiet",null,"Brukstadiet",null,null,null,null,null,"Livsløpets sluttstadium",null,null,null,"Konsekvenser utover systemgrensen"]
["Kategori","Materialer eller prosesser","Detaljert navn","Referanse","Geograsfiske opprinnelse","Funksjonell Enhet","Levetid (AV)","A1-3","A4","A5","B1","B2","B3","B4","B5","B6","C1","C2","C3","C4","D","kg/FU","A4 from EPD","A5 from EPD"]
["(Velg kategori)","(Velg material eller prosesser)",null,"-","-","-",0,0,0,0,0,0,0,0,0,0,0,0,0,0,0,null,0,0]
["_Bygningsdel","Bygningsdel 21, gjennomsnitt, per m2 bygg","gjennomsnittsverdier, fra ZEN report 24","ZEN report 24",null,"m2BTAår",null,{"$f":"1.2*0.75","v":0.89999999999999991},{"$f":"Utslippsfaktorer2[[#This Row],[kg/FU]]*$H$202","v":0},null,null,null,null,{"$f":"Utslippsfaktorer2[[#This Row],[A1-3]]*0.25","v":0.22499999999999998}]
["_Bygningsdel","Bygningsdel 22, gjennomsnitt, per m2 bygg","gjennomsnittsverdier, fra ZEN report 24","ZEN report 24",null,"m2BTAår",null,{"$f":"0.6*0.75","v":0.44999999999999996},{"$f":"Utslippsfaktorer2[[#This Row],[kg/FU]]*$H$202","v":0},null,null,null,null,{"$f":"Utslippsfaktorer2[[#This Row],[A1-3]]*0.25","v":0.11249999999999999}]
["_Bygningsdel","Bygningsdel 23, gjennomsnitt, per m2 bygg","gjennomsnittsverdier, fra ZEN report 24","ZEN report 24",null,"m2BTAår",null,{"$f":"1.2*0.75","v":0.89999999999999991},{"$f":"Utslippsfaktorer2[[#This Row],[kg/FU]]*$H$202","v":0},null,null,null,null,{"$f":"Utslippsfaktorer2[[#This Row],[A1-3]]*0.25","v":0.22499999999999998}]
["_Bygningsdel","Bygningsdel 24, gjennomsnitt, per m2 bygg","gjennomsnittsverdier, fra ZEN report 24","ZEN report 24",null,"m2BTAår",null,{"$f":"0.9*0.75","v":0.67500000000000004},{"$f":"Utslippsfaktorer2[[#This Row],[kg/FU]]*$H$202","v":0},null,null,null,null,{"$f":"Utslippsfaktorer2[[#This Row],[A1-3]]*0.25","v":0.16875000000000001}]
{"$rows_left_out":194}
{"sheet":"Input_rullegardin","index":9,"n_rows":51,"n_cols":23,"rows_kept":51,"cut":false,"hidden":true,"merged":[[49,8,49,13],[42,8,42,13],[43,8,43,13],[41,8,41,13],[44,8,44,13],[45,8,45,13],[46,8,46,13],[47,8,47,13],[48,8,48,13]]}
["Categories","dynamic:",null,null,"Utslippsnivå for A1-A3 og B4 ",null,null,null,null,"Tabel 2. Brutto energibehov [kWh/(m2 BRA·år)]. Kilde for Lite energieffektivt og TEK10-TEK17: PROFet1 (SINTEF). Kilder for TEK17: TEK17",null,null,null,null,null,null,"Database building impact (not scaled down for different RSP)"]
["(Velg kategori)",{"$f":"_xlfn.UNIQUE(#REF!)","v":{"$error":"#REF!"}},"Velg bygningskategoriene:",null,"Referansenivå"]
["Annet",null,"Småhus",null,"Klimavennlige materialer ",null,null,null,null,null,"Energieffektivitetsnivå3","Romoppvarming4","Oppvarming av varmt tappevann5","Elspesifikt6","Totalt",null,"Used in Skisseprosjekt",null,null,"A1-A3","A4","B4","Kilde"]
["Asfalt",null,"Boligblokk",null,"Ombruk ",null,null,null,{"$f":"J4&\" \"&K4","v":"Småhus Lite energieffektivt"},"Småhus","Lite energieffektivt",141,16,38,195,null,"Referansenivå","Småhus",{"$f":"_xlfn.CONCAT(Q4,\" \",R4)","v":"Referansenivå Småhus"},2.4,0.5,1.66,"ENOVA / AV rapport"]
["Belysning",null,"Kontorbygning",null,"Rehabilitering",null,null,null,"Småhus TEK10-TEK17","Småhus","TEK10-TEK17",76,16,38,130,null,"Referansenivå","Boligblokk","Referansenivå Boligblokk",5.38,1.04,1.62,"ENOVA / AV rapport"]
["Betong",null,"Forretningsbygning",null,null,null,null,null,"Småhus TEK17","Småhus","TEK17",57.951851851851849,25,28.9,111.85185185185185,null,"Referansenivå","Kontorbygning","Referansenivå Kontorbygning",4.3600000000000003,0.67,1.74,"ENOVA / AV rapport"]
["Binder",null,"Hotell",null,null,null,null,null,"Boligblokk Lite energieffektivt","Boligblokk","Lite energieffektivt",96,31,39,166,null,"Referansenivå","Forretningsbygning","Referansenivå Forretningsbygning",3.76,0.69,1.52,"ENOVA / AV rapport"]
["Bitumen",null,"Barnehage",null,null,null,null,null,"Boligblokk TEK10-TEK17","Boligblokk","TEK10-TEK17",52,31,39,122,null,"Referansenivå","Hotell","Referansenivå Hotell","NA","NA","NA"]
["Bygningsplater",null,"Skolebygning",null,null,null,null,null,"Boligblokk TEK17","Boligblokk","TEK17",41.1,25,28.9,95,null,"Referansenivå","Barnehage","Referansenivå Barnehage",3.87,0.09,0.09,"ZEN rapport 24, Kolstad barnehage"]
["Drivstoff",null,"Universitet",null,null,null,null,null,"Kontorbygning Lite energieffektivt","Kontorbygning","Lite energieffektivt",84,12,179,275,null,"Referansenivå","Skolebygning","Referansenivå Skolebygning",4.38,0.69,1.29,"ENOVA / AV rapport"]
{"$rows_left_out":41}